Mail archive
alpine-aports

Re: [alpine-aports] [PATCH] testing/seamonkey: upgrade to version 2.46

From: Leonardo Arena <rnalrd_at_gmail.com>
Date: Mon, 13 Feb 2017 13:39:14 +0100

Hi,

On dom, 2017-02-12 at 20:45 +0000, Marc Vertes wrote:
> ---
>  testing/seamonkey/APKBUILD                | 42 ++++++---------------
> ----------
>  testing/seamonkey/fix-aouth.patch         | 16 ++++++------
>  testing/seamonkey/fix-hunspell.patch      | 16 ++++++++++++
>  testing/seamonkey/fix-linux-syscall.patch | 25 ++++++++++--------
>  testing/seamonkey/mozconfig               | 21 +++++++---------
>  5 files changed, 56 insertions(+), 64 deletions(-)
>  create mode 100644 testing/seamonkey/fix-hunspell.patch
>

the patch was merged, but it does not build on x86:


make[4]: Entering directory
'/home/buildozer/aports/testing/seamonkey/src/seamonkey-2.46/obj-i686-
pc-linux-gnu/mozglue/misc'
mkdir -p '.deps/'
/usr/bin/g++ -std=gnu++11 -o StackWalk.o -c
-I/home/buildozer/aports/testing/seamonkey/src/seamonkey-2.46/obj-i686-
pc-linux-gnu/dist/stl_wrappers
-I/home/buildozer/aports/testing/seamonkey/src/seamonkey-2.46/obj-i686-
pc-linux-gnu/dist/system_wrappers -include
/home/buildozer/aports/testing/seamonkey/src/seamonkey-
2.46/mozilla/config/gcc_hidden.h -DNDEBUG=1 -DTRIMMED=1 -DIMPL_MFBT
-I/home/buildozer/aports/testing/seamonkey/src/seamonkey-
2.46/mozilla/mozglue/misc
-I/home/buildozer/aports/testing/seamonkey/src/seamonkey-2.46/obj-i686-
pc-linux-gnu/mozglue/misc  -
I/home/buildozer/aports/testing/seamonkey/src/seamonkey-2.46/obj-i686-
pc-linux-gnu/dist/include  -I/usr/include/nspr -I/usr/include/nss    -
I/usr/include/pixman-1   -fPIC  -DMOZILLA_CLIENT -include
/home/buildozer/aports/testing/seamonkey/src/seamonkey-2.46/obj-i686-
pc-linux-gnu/mozilla-config.h -MD -MP -MF .deps/StackWalk.o.pp  -Wall
-Wc++11-compat -Wempty-body -Wignored-qualifiers -Woverloaded-virtual
-Wpointer-arith -Wsign-compare -Wtype-limits -Wunreachable-code
-Wwrite-strings -Wc++14-compat -Wno-invalid-offsetof -Wno-error=maybe-
uninitialized -Wno-error=deprecated-declarations -Wno-error=array-
bounds -Os -fomit-frame-pointer -fno-exceptions -fno-strict-aliasing
-fno-rtti -ffunction-sections -fdata-sections -fno-exceptions -fno-
math-errno -pthread -pipe  -freorder-blocks -Os -fomit-frame-
pointer    /home/buildozer/aports/testing/seamonkey/src/seamonkey-
2.46/mozilla/mozglue/misc/StackWalk.cpp
libdom_inputport.a.desc
rm -f libdom_inputport.a
/home/buildozer/aports/testing/seamonkey/src/seamonkey-2.46/obj-i686-
pc-linux-gnu/_virtualenv/bin/python
/home/buildozer/aports/testing/seamonkey/src/seamonkey-
2.46/mozilla/config/expandlibs_gen.py -o libdom_inputport.a.desc
Unified_cpp_dom_inputport0.o  
/home/buildozer/aports/testing/seamonkey/src/seamonkey-
2.46/mozilla/mozglue/misc/StackWalk.cpp:938:4: error: #error
Unsupported configuration
 #  error Unsupported configuration
    ^~~~~
libmemory_mozalloc.a
rm -f libmemory_mozalloc.a libmemory_mozalloc.a.desc
make[4]: *** [/home/buildozer/aports/testing/seamonkey/src/seamonkey-
2.46/mozilla/config/rules.mk:936: StackWalk.o] Error 1
make[4]: Leaving directory
'/home/buildozer/aports/testing/seamonkey/src/seamonkey-2.46/obj-i686-
pc-linux-gnu/mozglue/misc'
make[3]: *** [/home/buildozer/aports/testing/seamonkey/src/seamonkey-
2.46/mozilla/config/recurse.mk:71: mozglue/misc/target] Error 2
make[3]: *** Waiting for unfinished jobs....

I'll disable x86 for now.

Thanks!

|_eo




---
Unsubscribe:  alpine-aports+unsubscribe_at_lists.alpinelinux.org
Help:         alpine-aports+help_at_lists.alpinelinux.org
---
Received on Mon Feb 13 2017 - 13:39:14 GMT