Mail archive
alpine-aports

Re: [alpine-aports] [PATCH] testing/extra-cmake-modules: update unmaintained aport to 5.31.0

From: Timo Teras <timo.teras_at_iki.fi>
Date: Tue, 21 Feb 2017 09:00:25 +0200

On Tue, 21 Feb 2017 00:11:55 +0800
Ivan Tham <pickfire_at_riseup.net> wrote:

> ---
> testing/extra-cmake-modules/APKBUILD | 30 ++++++++++++++++++++++
> unmaintained/extra-cmake-modules/APKBUILD | 42
> ------------------------------- 2 files changed, 30 insertions(+), 42
> deletions(-) create mode 100644 testing/extra-cmake-modules/APKBUILD
> delete mode 100644 unmaintained/extra-cmake-modules/APKBUILD

Failed to build with:

-- Configuring done
-- Generating done
-- Build files have been written to: /home/tteras/aports/testing/extra-cmake-modules/src/extra-cmake-modules-5.31.0/build
Scanning dependencies of target documentation
[ 50%] sphinx-build html: see /home/tteras/aports/testing/extra-cmake-modules/src/extra-cmake-modules-5.31.0/build/docs/build-html.log
Traceback (most recent call last):
  File "/usr/bin/sphinx-build", line 6, in <module>
    from pkg_resources import load_entry_point
  File "/usr/lib/python3.6/site-packages/pkg_resources/__init__.py", line 3003, in _call_aside
    f(*args, **kwargs)
  File "/usr/lib/python3.6/site-packages/pkg_resources/__init__.py", line 3030, in _initialize_master_working_set
    working_set = WorkingSet._build_master()
  File "/usr/lib/python3.6/site-packages/pkg_resources/__init__.py", line 659, in _build_master
    ws.require(__requires__)
  File "/usr/lib/python3.6/site-packages/pkg_resources/__init__.py", line 967, in require
    needed = self.resolve(parse_requirements(requirements))
  File "/usr/lib/python3.6/site-packages/pkg_resources/__init__.py", line 853, in resolve
    raise DistributionNotFound(req, requirers)
pkg_resources.DistributionNotFound: The 'requests>=2.4.0' distribution was not found and is required by Sphinx
make[2]: *** [docs/CMakeFiles/documentation.dir/build.make:62: docs/doc_format_html] Error 1
make[1]: *** [CMakeFiles/Makefile2:86: docs/CMakeFiles/documentation.dir/all] Error 2
make: *** [Makefile:139: all] Error 2
>>> ERROR: extra-cmake-modules: all failed





---
Unsubscribe:  alpine-aports+unsubscribe_at_lists.alpinelinux.org
Help:         alpine-aports+help_at_lists.alpinelinux.org
---
Received on Tue Feb 21 2017 - 09:00:25 GMT