Mail archive
alpine-aports

Re: [alpine-aports] [PATCH] main/zeromq: upgrade to 4.2.2

From: Valery Kartel <valery.kartel_at_gmail.com>
Date: Thu, 6 Apr 2017 15:54:08 +0300

Hmm, check() pass OK only when runs interactively, but fails when runs via
'abuild check'.

made a patch.

2017-04-03 11:21 GMT+03:00 Leonardo Arena <rnalrd_at_gmail.com>:

> Hi,
>
> On 23/03/2017 12:19, Leonardo Arena wrote:
> > Hi,
> >
> > On 23/03/2017 10:09, Valery Kartel wrote:
> >> - add check()
> >> - cleanups
> >> ---
> >> main/zeromq/APKBUILD | 35 ++++++++++++++---------------------
> >> 1 file changed, 14 insertions(+), 21 deletions(-)
> >>
>
> I've just tested the patch here and it fails on check()
>
>
> PASS: tests/test_ancillaries
> PASS: tests/test_pair_tcp
> PASS: tests/test_pair_inproc
> PASS: tests/test_reqrep_inproc
> PASS: tests/test_system
> PASS: tests/test_reqrep_tcp
> PASS: tests/test_hwm
> ./config/test-driver: line 107: 19351 Aborted "$_at_" >
> $log_file 2>&1
> FAIL: tests/test_reqrep_device
> PASS: tests/test_invalid_rep
> PASS: tests/test_msg_flags
> PASS: tests/test_connect_resolve
> PASS: tests/test_sub_forward
> PASS: tests/test_last_endpoint
> ./config/test-driver: line 107: 19607 Aborted "$_at_" >
> $log_file 2>&1
> FAIL: tests/test_term_endpoint
> ./config/test-driver: line 107: 19718 Aborted "$_at_" >
> $log_file 2>&1
> FAIL: tests/test_srcfd
> PASS: tests/test_monitor
> ./config/test-driver: line 107: 19777 Aborted "$_at_" >
> $log_file 2>&1
> FAIL: tests/test_router_mandatory
> ./config/test-driver: line 107: 19807 Aborted "$_at_" >
> $log_file 2>&1
> FAIL: tests/test_router_mandatory_hwm
> ./config/test-driver: line 107: 19841 Aborted "$_at_" >
> $log_file 2>&1
> FAIL: tests/test_router_handover
> PASS: tests/test_probe_router
> PASS: tests/test_stream
> ./config/test-driver: line 107: 20039 Aborted "$_at_" >
> $log_file 2>&1
> FAIL: tests/test_stream_empty
> PASS: tests/test_stream_disconnect
> PASS: tests/test_hwm_pubsub
> PASS: tests/test_msg_ffn
> PASS: tests/test_unbind_inproc
> ./config/test-driver: line 107: 20188 Aborted "$_at_" >
> $log_file 2>&1
> FAIL: tests/test_unbind_wildcard
> PASS: tests/test_stream_timeout
> PASS: tests/test_ctx_options
> PASS: tests/test_ctx_destroy
> PASS: tests/test_disconnect_inproc
> ./config/test-driver: line 107: 20338 Aborted "$_at_" >
> $log_file 2>&1
> FAIL: tests/test_security_curve
> PASS: tests/test_iov
> PASS: tests/test_security_null
> PASS: tests/test_security_plain
> ./config/test-driver: line 107: 20427 Aborted "$_at_" >
> $log_file 2>&1
> FAIL: tests/test_spec_rep
> PASS: tests/test_immediate
> PASS: tests/test_spec_req
> PASS: tests/test_req_correlate
> PASS: tests/test_spec_router
> ./config/test-driver: line 107: 20607 Aborted "$_at_" >
> $log_file 2>&1
> FAIL: tests/test_conflate
> ./config/test-driver: line 107: 20458 Aborted "$_at_" >
> $log_file 2>&1
> FAIL: tests/test_spec_dealer
> ./config/test-driver: line 107: 20669 Aborted "$_at_" >
> $log_file 2>&1
> FAIL: tests/test_issue_566
> PASS: tests/test_inproc_connect
> ./config/test-driver: line 107: 20882 Segmentation fault "$_at_" >
> $log_file 2>&1
> FAIL: tests/test_proxy_single_socket
> PASS: tests/test_proxy
> PASS: tests/test_getsockopt_memset
> PASS: tests/test_setsockopt
> PASS: tests/test_many_sockets
> PASS: tests/test_diffserv
> PASS: tests/test_connect_rid
> PASS: tests/test_bind_src_address
> ./config/test-driver: line 107: 20516 Aborted "$_at_" >
> $log_file 2>&1
> FAIL: tests/test_spec_pushpull
> PASS: tests/test_metadata
> PASS: tests/test_capabilities
> PASS: tests/test_xpub_nodrop
> PASS: tests/test_xpub_welcome_msg
> PASS: tests/test_atomics
> PASS: tests/test_req_relaxed
> PASS: tests/test_proxy_terminate
> PASS: tests/test_sockopt_hwm
> PASS: tests/test_stream_exceeds_buffer
> PASS: tests/test_pub_invert_matching
> PASS: tests/test_base85
> PASS: tests/test_sodium
> PASS: tests/test_bind_after_connect_tcp
> PASS: tests/test_shutdown_stress
> PASS: tests/test_ipc_wildcard
> PASS: tests/test_pair_ipc
> PASS: tests/test_reqrep_ipc
> PASS: tests/test_use_fd_ipc
> PASS: tests/test_use_fd_tcp
> PASS: tests/test_zmq_poll_fd
> PASS: tests/test_timeo
> PASS: tests/test_fork
> PASS: tests/test_abstract_ipc
> PASS: tests/test_heartbeats
> ./config/test-driver: line 107: 22824 Aborted "$_at_" >
> $log_file 2>&1
> FAIL: tests/test_filter_ipc
> PASS: tests/test_xpub_manual
> make[4]: Entering directory
> '/home/larena/aports/main/zeromq/src/zeromq-4.2.2'
> Making all in doc
> make[5]: Entering directory
> '/home/larena/aports/main/zeromq/src/zeromq-4.2.2/doc'
> make[5]: Nothing to be done for 'all'.
> make[5]: Leaving directory
> '/home/larena/aports/main/zeromq/src/zeromq-4.2.2/doc'
> make[5]: Entering directory
> '/home/larena/aports/main/zeromq/src/zeromq-4.2.2'
> make[5]: Leaving directory
> '/home/larena/aports/main/zeromq/src/zeromq-4.2.2'
> make[4]: Leaving directory
> '/home/larena/aports/main/zeromq/src/zeromq-4.2.2'
> ============================================================
> ================
> Testsuite summary for zeromq 4.2.2
> ============================================================
> ================
> # TOTAL: 79
> # PASS: 63
> # SKIP: 0
> # XFAIL: 0
> # FAIL: 16
> # XPASS: 0
> # ERROR: 0
> ============================================================
> ================
> See ./test-suite.log
> Please report to zeromq-dev_at_lists.zeromq.org
> ============================================================
> ================
> make[3]: *** [Makefile:4159: test-suite.log] Error 1
> make[3]: Leaving directory
> '/home/larena/aports/main/zeromq/src/zeromq-4.2.2'
> make[2]: *** [Makefile:4267: check-TESTS] Error 2
> make[2]: Leaving directory
> '/home/larena/aports/main/zeromq/src/zeromq-4.2.2'
> make[1]: *** [Makefile:5170: check-am] Error 2
> make[1]: Leaving directory
> '/home/larena/aports/main/zeromq/src/zeromq-4.2.2'
> make: *** [Makefile:4044: check-recursive] Error 1
> make: Leaving directory '/home/larena/aports/main/zeromq/src/zeromq-4.2.2'
> >>> ERROR: zeromq*: check failed
> >>> ERROR: zeromq: all failed
>
>
> |_eo
>
>



---
Unsubscribe:  alpine-aports+unsubscribe_at_lists.alpinelinux.org
Help:         alpine-aports+help_at_lists.alpinelinux.org
---
Received on Thu Apr 06 2017 - 15:54:08 UTC