Mail archive
alpine-aports

Re: [alpine-aports] [PATCH 1/3] New aport: testing/py-sh

From: Leonardo Arena <rnalrd_at_gmail.com>
Date: Thu, 18 Oct 2018 11:05:49 +0200

Hi,

On Tue, Oct 16, 2018 at 4:03 PM Marian Buschsieweke <
marian.buschsieweke_at_ovgu.de> wrote:

> Call any program from python as if it were a function
> https://github.com/amoffat/sh
> ---
> testing/py-sh/APKBUILD | 51 ++++++++++++++++++++++++++++++++++++++++++
> 1 file changed, 51 insertions(+)
> create mode 100644 testing/py-sh/APKBUILD
>


it fails for me with:


======================================================================
FAIL: test_no_fd_leak (test.MiscTests)
----------------------------------------------------------------------
Traceback (most recent call last):
  File "/home/larena/aports/testing/py-sh/src/sh-1.12.14/test.py", line
2715, in test_no_fd_leak
    self.assertEqual(baseline, num_fds)
AssertionError: 920 != 919

----------------------------------------------------------------------
Ran 156 tests in 38.952s

FAILED (failures=1, skipped=3)
Test failed: <unittest.runner.TextTestResult run=156 errors=0 failures=1>
error: Test failed: <unittest.runner.TextTestResult run=156 errors=0
failures=1>


Thanks!

/eo



---
Unsubscribe:  alpine-aports+unsubscribe_at_lists.alpinelinux.org
Help:         alpine-aports+help_at_lists.alpinelinux.org
---
Received on Thu Oct 18 2018 - 11:05:49 UTC